Reaction Details
TargetInterstitial collagenase
LigandBDBM50104969
Substrate/Competitorn/a
Meas. Tech.ChEBML_49511
Ki 6±n/a nM
Citation Singh, JConzentino, PCundy, KGainor, JAGilliam, CLGordon, TDJohnson, JAMorgan, BASchneider, EDWahl, RCWhipple, DA Relationship between structure and bioavailability in a series of hydroxamate based metalloprotease inhibitors Bioorg Med Chem Lett5:337-342 (1995)    Article
 
Interstitial collagenase
Name:Interstitial collagenase
Type:Enzyme
Mol. Mass.:54010.26
Organism:Homo sapiens (Human)
Description: P03956
Residue:469
BDBM50104969
NameBDBM50104969
Synonyms:(R)-N*4*-Hydroxy-2-isobutyl-N*1*-[(S)-2-(4-methoxy-phenyl)-1-methylcarbamoyl-ethyl]-succinamide N*4*-Hydroxy-2-isobutyl-N*1*-[2-(4-methoxy-phenyl)-1-methylcarbamoyl-ethyl]-succinamide SC-44463
TypeSmall organic molecule
Emp. Form.C19H29N3O5
Mol. Mass.379.4507
SMILESCNC(=O)[C@H](Cc1ccc(OC)cc1)NC(=O)[C@H](CC(C)C)CC(=O)NO