Reaction Details
TargetD(1A) dopamine receptor
LigandBDBM50287046
Substrate/Competitorn/a
Meas. Tech.ChEBML_58186
IC50 2.1±n/a nM
Citation Archer, SGlick, SDMaisonneuve, IMBidlack, JMXu, JYTeitler, MSebastian, AEl-Hamouly, WHutchinson, I Suppression of morphine and cocaine self-administration in rats by a mixed mu antagonist-kappa agonist (N-CBM-TAMO) and a long-acting selective D1 antagonist (AS-300) Bioorg Med Chem Lett6:1139-1144 (1996)    Article
 
D(1A) dopamine receptor
Name:D(1A) dopamine receptor
Type:Enzyme Catalytic Domain
Mol. Mass.:49429.75
Organism:RAT
Description:P18901
Residue:446
BDBM50287046
NameBDBM50287046
Synonyms:8-Chloro-5-(3-isothiocyanato-phenyl)-3-methyl-2,3,4,5-tetrahydro-1H-benzo[d]azepin-7-ol CHEMBL279634
TypeSmall organic molecule
Emp. Form.C18H17ClN2OS
Mol. Mass.344.858
SMILESCN1CCc2cc(Cl)c(O)cc2C(C1)c1cccc(c1)N=C=S