Reaction Details
TargetProthrombin
LigandBDBM50027306
Substrate/Competitorn/a
Meas. Tech.ChEBML_207954
IC50 22000±n/a nM
Citation Iwanowicz, EJLau, WFLin, JRoberts, DGSeiler, SM Derivatives of 5-amidine indole as inhibitors of thrombin catalytic activity Bioorg Med Chem Lett6:1339-1344 (1996)    Article
 
Prothrombin
Name:Prothrombin
Type:Protein
Mol. Mass.:70029.57
Organism:Homo sapiens (Human)
Description:P00734
Residue:622
BDBM50027306
NameBDBM50027306
Synonyms:1H-Indole-5-carboxamidine | CHEMBL26490
TypeSmall organic molecule
Emp. Form.C9H9N3
Mol. Mass.159.1879
SMILESNC(=N)c1ccc2[nH]ccc2c1