Reaction Details
TargetArachidonate 5-lipoxygenase-activating protein/Polyunsaturated fatty acid 5-lipoxygenase
LigandBDBM50006805
Substrate/Competitorn/a
Meas. Tech.ChEMBL_88346 (CHEMBL700005)
IC50 30±n/a nM
Citation Woods, KWBrooks, CDMaki, RGRodriques, KEBouska, JBYoung, PBell, RLCarter, GW O-alkylcarboxylate oxime and N-hydroxyurea analogs of substituted indole leukotriene biosynthesis inhibitors Bioorg Med Chem Lett6:1547-1552 (1996)    Article
 
Arachidonate 5-lipoxygenase-activating protein/Polyunsaturated fatty acid 5-lipoxygenase
Name:Arachidonate 5-lipoxygenase-activating protein/Polyunsaturated fatty acid 5-lipoxygenase
Synonyms:5-Lipoxygenase/5-lipoxygenase activating protein
Type:n/a
Mol. Mass.:n/a
Description:ASSAY_ID of EBI is 88346
Components:This complex has 2 components.
Component 1
Name:Polyunsaturated fatty acid 5-lipoxygenase
Type:Enzyme
Mol. Mass.:77972.74
Organism:Homo sapiens (Human)
Description:Recombinant protein was purified from E. coli lysate. After ammonium sulfate precipitation and subsequent steps, the supernatant (S100) was used for 5-LO activity assay.
Residue:674
Component 2
Name:Arachidonate 5-lipoxygenase-activating protein
Synonyms:5-lipoxygenase activating protein 5-lipoxygenase/FLAP ALOX5AP MK-886-binding protein
Type:Enzyme
Mol. Mass.:18159.90
Organism:Homo sapiens (Human)
Description:P20292
Residue:161
BDBM50006805
NameBDBM50006805
Synonyms:3-(1-(4-chlorobenzyl)-3-(tert-butylthio)-5-isopropyl-1H-indol-2-yl)-2,2-dimethylpropanoic acid 3-[1-(4-chlorobenzyl)-3-t-butyl-thio-5-isopropylindol-2-yl]-2,2-dimethylpropanoic acid CHEMBL29097 MK886 | cid_3651377
TypeSmall organic molecule
Emp. Form.C27H34ClNO2S
Mol. Mass.472.082
SMILESCC(C)c1ccc2n(Cc3ccc(Cl)cc3)c(CC(C)(C)C(O)=O)c(SC(C)(C)C)c2c1