Reaction Details
TargetcGMP-inhibited 3',5'-cyclic phosphodiesterase 3A/3B
LigandBDBM50287550
Substrate/Competitorn/a
Meas. Tech.ChEBML_156630
IC50 62000±n/a nM
Citation Terrett, NKBell, ASBrown, DEllis, P Sildenafil (VIAGRATM), a potent and selective inhibitor of type 5 cGMP phosphodiesterase with utility for the treatment of male erectile dysfunction Bioorg Med Chem Lett6:1819-1824 (1996)    Article
 
cGMP-inhibited 3',5'-cyclic phosphodiesterase 3A/3B
Name:cGMP-inhibited 3',5'-cyclic phosphodiesterase 3A/3B
Type:n/a
Mol. Mass.:n/a
Description:ASSAY_ID of ChEMBL is 156458
Components:This complex has 2 components.
Component 1
Name:cGMP-inhibited 3',5'-cyclic phosphodiesterase 3B
Synonyms:CGI-PDE B CGIPDE1 PDE3B Phosphodiesterase 3B Phosphodiesterase Type 3 (PDE3B) cGMP-inhibited 3,5-cyclic phosphodiesterase B
Type:Enzyme
Mol. Mass.:124318.95
Organism:Homo sapiens (Human)
Description:PDE3B was generated from the full-length recombinant human clone transfected into Sf9 cells.
Residue:1112
Component 2
Name:cGMP-inhibited 3',5'-cyclic phosphodiesterase 3A
Synonyms:3',5'-cyclic phosphodiesterase Cyclic GMP-inhibited phosphodiesterase A PDE3A_HUMAN Phosphodiesterase 3 (PDE3) Phosphodiesterase 3A Phosphodiesterase 3A (PDE3A1) cGMP-inhibited 3',5'-cyclic phosphodiesterase A | cGMP-inhibited 3,5-cyclic phosphodiesterase A
Type:Enzyme
Mol. Mass.:124966.46
Organism:Homo sapiens (Human)
Description:Q14432
Residue:1141
BDBM50287550
NameBDBM50287550
Synonyms:5-(2-ethoxy-5-(4-(2-hydroxyethyl)piperazin-1-ylsulfonyl)phenyl)-1-methyl-3-propyl-1H-pyrazolo[4,3-d]pyrimidin-7(6H)-one CHEMBL53538
TypeSmall organic molecule
Emp. Form.C23H32N6O5S
Mol. Mass.504.602
SMILESCCCc1nn(C)c2c1nc([nH]c2=O)-c1cc(ccc1OCC)S(=O)(=O)N1CCN(CCO)CC1