Reaction Details
TargetcGMP-specific 3',5'-cyclic phosphodiesterase
LigandBDBM50287550
Substrate/Competitorn/a
Meas. Tech.ChEBML_155206
IC50 19±n/a nM
Citation Terrett, NKBell, ASBrown, DEllis, P Sildenafil (VIAGRATM), a potent and selective inhibitor of type 5 cGMP phosphodiesterase with utility for the treatment of male erectile dysfunction Bioorg Med Chem Lett6:1819-1824 (1996)    Article
 
cGMP-specific 3',5'-cyclic phosphodiesterase
Name:cGMP-specific 3',5'-cyclic phosphodiesterase
Type:Protein
Mol. Mass.:99975.83
Organism:Homo sapiens (Human)
Description:O76074
Residue:875
BDBM50287550
NameBDBM50287550
Synonyms:5-(2-ethoxy-5-(4-(2-hydroxyethyl)piperazin-1-ylsulfonyl)phenyl)-1-methyl-3-propyl-1H-pyrazolo[4,3-d]pyrimidin-7(6H)-one CHEMBL53538
TypeSmall organic molecule
Emp. Form.C23H32N6O5S
Mol. Mass.504.602
SMILESCCCc1nn(C)c2c1nc([nH]c2=O)-c1cc(ccc1OCC)S(=O)(=O)N1CCN(CCO)CC1