Reaction Details
TargetAlpha-1A adrenergic receptor
LigandBDBM50287723
Substrate/Competitorn/a
Meas. Tech.ChEBML_32889
Ki 2140±n/a nM
Citation Phife, DWRamos, RAFeng, MKing, IGunasekera, SPWright, APatel, MPachter, JACoval, SJ Marine sponge bis(indole) alkaloids that displace ligand binding to α1 adrenergic receptors Bioorg Med Chem Lett6:2103-2106 (1996)    Article
 
Alpha-1A adrenergic receptor
Name:Alpha-1A adrenergic receptor
Type:Cell-surface receptors
Mol. Mass.:51511.67
Organism:Homo sapiens (Human)
Description:P35348
Residue:466
BDBM50287723
NameBDBM50287723
Synonyms:6-bromo-3-[4-(6-bromo-1H-3-indolyl)-1H-2-imidazolyl]-1H-indole Nortopsentin A
TypeSmall organic molecule
Emp. Form.C19H12Br2N4
Mol. Mass.456.133
SMILESBrc1ccc2c(c[nH]c2c1)-c1c[nH]c(n1)-c1c[nH]c2cc(Br)ccc12