Reaction Details
TargetAlpha-1A adrenergic receptor
LigandBDBM50287719
Substrate/Competitorn/a
Meas. Tech.ChEBML_32889
Ki 550±n/a nM
Citation Phife, DWRamos, RAFeng, MKing, IGunasekera, SPWright, APatel, MPachter, JACoval, SJ Marine sponge bis(indole) alkaloids that displace ligand binding to α1 adrenergic receptors Bioorg Med Chem Lett6:2103-2106 (1996)    Article
 
Alpha-1A adrenergic receptor
Name:Alpha-1A adrenergic receptor
Type:Cell-surface receptors
Mol. Mass.:51511.67
Organism:Homo sapiens (Human)
Description:P35348
Residue:466
BDBM50287719
NameBDBM50287719
Synonyms:6-Bromo-3-[2-(1H-indol-3-yl)-1H-imidazol-4-yl]-1H-indole Nortopsentin C
TypeSmall organic molecule
Emp. Form.C19H13BrN4
Mol. Mass.377.237
SMILESBrc1ccc2c(c[nH]c2c1)-c1c[nH]c(n1)-c1c[nH]c2ccccc12