Reaction Details
TargetCannabinoid receptor 1
LigandBDBM50240608
Substrate/Competitorn/a
Meas. Tech.ChEBML_46464
Ki 2043±n/a nM
Citation Gallant, MDufresne, CGareau, YGuay, DLeblanc, YPrasit, PRochette, CSawyer, NSlipetz, DMTremblay, NMetters, KMLabelle, M New class of potent ligands for the human peripheral cannabinoid receptor Bioorg Med Chem Lett6:2263-2268 (1996)    Article
 
Cannabinoid receptor 1
Name:Cannabinoid receptor 1
Type:G Protein-Coupled Receptor (GPCR)
Mol. Mass.:52868.96
Organism:Homo sapiens (Human)
Description:P21554
Residue:472
BDBM50240608
NameBDBM50240608
Synonyms:2-(1-(2,3-dichlorobenzoyl)-5-methoxy-2-methyl-1H-indol-3-yl)-1-morpholinoethanone CHEMBL72374
TypeSmall organic molecule
Emp. Form.C23H22Cl2N2O4
Mol. Mass.461.338
SMILESCOc1ccc2n(C(=O)c3cccc(Cl)c3Cl)c(C)c(CC(=O)N3CCOCC3)c2c1