Reaction Details
TargetCannabinoid receptor 2
LigandBDBM50240605
Substrate/Competitorn/a
Meas. Tech.ChEBML_46993
Ki 22±n/a nM
Citation Gallant, MDufresne, CGareau, YGuay, DLeblanc, YPrasit, PRochette, CSawyer, NSlipetz, DMTremblay, NMetters, KMLabelle, M New class of potent ligands for the human peripheral cannabinoid receptor Bioorg Med Chem Lett6:2263-2268 (1996)    Article
 
Cannabinoid receptor 2
Name:Cannabinoid receptor 2
Type:G Protein-Coupled Receptor (GPCR)
Mol. Mass.:39690.94
Organism:Homo sapiens (Human)
Description:P34972
Residue:360
BDBM50240605
NameBDBM50240605
Synonyms:(2,3-Dichloro-phenyl)-(5-methoxy-2-methyl-3-morpholin-4-ylmethyl-indol-1-yl)-methanone CHEMBL308777
TypeSmall organic molecule
Emp. Form.C22H22Cl2N2O3
Mol. Mass.433.328
SMILESCOc1ccc2n(C(=O)c3cccc(Cl)c3Cl)c(C)c(CN3CCOCC3)c2c1