Reaction Details
TargetCannabinoid receptor 2
LigandBDBM50287811
Substrate/Competitorn/a
Meas. Tech.ChEBML_46993
Ki 1046±n/a nM
Citation Gallant, MDufresne, CGareau, YGuay, DLeblanc, YPrasit, PRochette, CSawyer, NSlipetz, DMTremblay, NMetters, KMLabelle, M New class of potent ligands for the human peripheral cannabinoid receptor Bioorg Med Chem Lett6:2263-2268 (1996)    Article
 
Cannabinoid receptor 2
Name:Cannabinoid receptor 2
Type:G Protein-Coupled Receptor (GPCR)
Mol. Mass.:39690.94
Organism:Homo sapiens (Human)
Description:P34972
Residue:360
BDBM50287811
NameBDBM50287811
Synonyms:2-[1-(2,3-Dichloro-benzyl)-5-methoxy-2-methyl-1H-indol-3-yl]-1-morpholin-4-yl-ethanone | CHEMBL308847
TypeSmall organic molecule
Emp. Form.C23H24Cl2N2O3
Mol. Mass.447.354
SMILESCOc1ccc2n(Cc3cccc(Cl)c3Cl)c(C)c(CC(=O)N3CCOCC3)c2c1