Reaction Details
TargetGTPase HRas
LigandBDBM50287948
Substrate/Competitorn/a
Meas. Tech.ChEBML_143166
IC50 14000±n/a nM
Citation Wolin, RWang, DKelly, JAfonso, AJames, LKirschmeier, PMcPhail, AT Synthesis and evaluation of pyrazolo[3,4-b]quinoline ribofuranosides and their derivatives as inhibitors of oncogenic Ras Bioorg Med Chem Lett6:195-200 (1996)    Article
 
GTPase HRas
Name:GTPase HRas
Type:Other Protein Type
Mol. Mass.:21293.37
Organism:Homo sapiens (Human)
Description:P01112
Residue:189
BDBM50287948
NameBDBM50287948
Synonyms:CHEMBL64886 | [(2S,6R)-6-(4-Chloro-6-methoxy-3-methyl-pyrazolo[3,4-b]quinolin-1-yl)-4-(2-nitro-benzenesulfonyl)-morpholin-2-yl]-methanol
TypeSmall organic molecule
Emp. Form.C23H22ClN5O5S
Mol. Mass.515.969
SMILESCOc1ccc2nc3n(nc(C)c3c(Cl)c2c1)[C@H]1CN(C[C@@H](CO)O1)Sc1ccccc1[N+]([O-])=O