Reaction Details
TargetGTPase HRas
LigandBDBM50287960
Substrate/Competitorn/a
Meas. Tech.ChEBML_143166
IC50 1000±n/a nM
Citation Wolin, RWang, DKelly, JAfonso, AJames, LKirschmeier, PMcPhail, AT Synthesis and evaluation of pyrazolo[3,4-b]quinoline ribofuranosides and their derivatives as inhibitors of oncogenic Ras Bioorg Med Chem Lett6:195-200 (1996)    Article
 
GTPase HRas
Name:GTPase HRas
Type:Other Protein Type
Mol. Mass.:21293.37
Organism:Homo sapiens (Human)
Description:P01112
Residue:189
BDBM50287960
NameBDBM50287960
Synonyms:1-[(2R,6S)-6-(tert-Butyl-dimethyl-silanyloxymethyl)-4-(2-nitro-benzenesulfonyl)-morpholin-2-yl]-4-chloro-6-methoxy-3-methyl-1H-pyrazolo[3,4-b]quinoline | CHEMBL304462
TypeSmall organic molecule
Emp. Form.C29H36ClN5O5SSi
Mol. Mass.630.23
SMILESCOc1ccc2nc3n(nc(C)c3c(Cl)c2c1)[C@H]1CN(C[C@@H](CO[Si](C)(C)C(C)(C)C)O1)Sc1ccccc1[N+]([O-])=O