Reaction Details
TargetMetabotropic glutamate receptor 2
LigandBDBM50288204
Substrate/Competitorn/a
Meas. Tech.ChEMBL_218846 (CHEMBL823394)
IC50>600000±n/a nM
Citation Kozikowski, APLiao, YTückmantel, WWang, SPshenichkin, SSurin, AThomsen, CWroblewski, JT Synthesis and biology of the rigidified glutamate analogue, trans-2-carboxyazetidine-3-acetic acid (t-CAA) Bioorg Med Chem Lett6:2559-2564 (1996)    Article
 
Metabotropic glutamate receptor 2
Name:Metabotropic glutamate receptor 2
Type:Enzyme
Mol. Mass.:95584.88
Organism:Homo sapiens (Human)
Description:Q14416
Residue:872
BDBM50288204
NameBDBM50288204
Synonyms:(2S,3S)-3-Carboxymethyl-azetidine-2-carboxylic acid | CHEMBL314690
TypeSmall organic molecule
Emp. Form.C6H9NO4
Mol. Mass.159.14
SMILESOC(=O)C[C@H]1CN[C@@H]1C(O)=O