Reaction Details
TargetMetabotropic glutamate receptor 6
LigandBDBM50288204
Substrate/Competitorn/a
Meas. Tech.ChEMBL_218852 (CHEMBL822310)
IC50>300000±n/a nM
Citation Kozikowski, APLiao, YTückmantel, WWang, SPshenichkin, SSurin, AThomsen, CWroblewski, JT Synthesis and biology of the rigidified glutamate analogue, trans-2-carboxyazetidine-3-acetic acid (t-CAA) Bioorg Med Chem Lett6:2559-2564 (1996)    Article
 
Metabotropic glutamate receptor 6
Name:Metabotropic glutamate receptor 6
Type:Enzyme Catalytic Domain
Mol. Mass.:95479.26
Organism:Homo sapiens (Human)
Description:metabotropic glutamate 6 GRM6 HUMAN::O15303
Residue:877
BDBM50288204
NameBDBM50288204
Synonyms:(2S,3S)-3-Carboxymethyl-azetidine-2-carboxylic acid | CHEMBL314690
TypeSmall organic molecule
Emp. Form.C6H9NO4
Mol. Mass.159.14
SMILESOC(=O)C[C@H]1CN[C@@H]1C(O)=O