Reaction Details
TargetProstaglandin G/H synthase 2
LigandBDBM50288289
Substrate/Competitorn/a
Meas. Tech.ChEBML_159735
IC50 1.2±n/a nM
Citation Friesen, RWDubé, DFortin, RFrenette, RPrescott, SCromlish, WGreig, GMKargman, SWong, EChan, CCGordon, RXu, LJRiendeau, D Novel 1,2-diarylcyclobutenes: Selective and orally active cox-2 inhibitors Bioorg Med Chem Lett6:2677-2682 (1996)    Article
 
Prostaglandin G/H synthase 2
Name:Prostaglandin G/H synthase 2
Type:Enzyme
Mol. Mass.:69003.89
Organism:Homo sapiens (Human)
Description:Recombinant Cox-2 provided by Cayman (Cayman Chemical Co.,Ann Arbor, MI).
Residue:604
BDBM50288289
NameBDBM50288289
Synonyms:1-Methanesulfonyl-4-(3-methylene-2-phenyl-cyclobut-1-enyl)-benzene | CHEMBL91118
TypeSmall organic molecule
Emp. Form.C18H16O2S
Mol. Mass.296.383
SMILESCS(=O)(=O)c1ccc(cc1)C1=C(C(=C)C1)c1ccccc1