Reaction Details
TargetComplement C1r subcomponent
LigandBDBM50289007
Substrate/Competitorn/a
Meas. Tech.ChEMBL_40170 (CHEMBL655965)
IC50 700±n/a nM
Citation Gilmore, JLHays, SJCaprathe, BWLee, CEmmerling, MRMichael, WJaen, JC Synthesis and evaluation of 2-aryl-4H-3,1-benzoxazin-4-ones as C1r serine protease inhibitors Bioorg Med Chem Lett6:679-682 (1996)    Article
 
Complement C1r subcomponent
Name:Complement C1r subcomponent
Type:Enzyme
Mol. Mass.:80113.65
Organism:Homo sapiens (Human)
Description:P00736
Residue:705
BDBM50289007
NameBDBM50289007
Synonyms:2-(2-Iodo-phenyl)-naphtho[2,3-d][1,3]oxazin-4-one | CHEMBL158926
TypeSmall organic molecule
Emp. Form.C18H10INO2
Mol. Mass.399.182
SMILESIc1ccccc1-c1nc2cc3ccccc3cc2c(=O)o1