Reaction Details
TargetComplement C1r subcomponent
LigandBDBM50289011
Substrate/Competitorn/a
Meas. Tech.ChEMBL_40170 (CHEMBL655965)
IC50 5000±n/a nM
Citation Gilmore, JLHays, SJCaprathe, BWLee, CEmmerling, MRMichael, WJaen, JC Synthesis and evaluation of 2-aryl-4H-3,1-benzoxazin-4-ones as C1r serine protease inhibitors Bioorg Med Chem Lett6:679-682 (1996)    Article
 
Complement C1r subcomponent
Name:Complement C1r subcomponent
Type:Enzyme
Mol. Mass.:80113.65
Organism:Homo sapiens (Human)
Description:P00736
Residue:705
BDBM50289011
NameBDBM50289011
Synonyms:2-(2-Iodo-phenyl)-6-methoxy-benzo[d][1,3]oxazin-4-one | CHEMBL157987
TypeSmall organic molecule
Emp. Form.C15H10INO3
Mol. Mass.379.1493
SMILESCOc1ccc2nc(oc(=O)c2c1)-c1ccccc1I