Reaction Details
TargetComplement C1r subcomponent
LigandBDBM50289004
Substrate/Competitorn/a
Meas. Tech.ChEMBL_40171 (CHEMBL655966)
IC50 7800±n/a nM
Citation Gilmore, JLHays, SJCaprathe, BWLee, CEmmerling, MRMichael, WJaen, JC Synthesis and evaluation of 2-aryl-4H-3,1-benzoxazin-4-ones as C1r serine protease inhibitors Bioorg Med Chem Lett6:679-682 (1996)    Article
 
Complement C1r subcomponent
Name:Complement C1r subcomponent
Type:Enzyme
Mol. Mass.:80113.65
Organism:Homo sapiens (Human)
Description:P00736
Residue:705
BDBM50289004
NameBDBM50289004
Synonyms:6-Chloro-2-(2-iodo-phenyl)-benzo[d][1,3]oxazin-4-one | CHEMBL158577
TypeSmall organic molecule
Emp. Form.C14H7ClINO2
Mol. Mass.383.568
SMILESClc1ccc2nc(oc(=O)c2c1)-c1ccccc1I