Reaction Details
TargetComplement C1r subcomponent
LigandBDBM50289001
Substrate/Competitorn/a
Meas. Tech.ChEMBL_40171 (CHEMBL655966)
IC50>62500±n/a nM
Citation Gilmore, JLHays, SJCaprathe, BWLee, CEmmerling, MRMichael, WJaen, JC Synthesis and evaluation of 2-aryl-4H-3,1-benzoxazin-4-ones as C1r serine protease inhibitors Bioorg Med Chem Lett6:679-682 (1996)    Article
 
Complement C1r subcomponent
Name:Complement C1r subcomponent
Type:Enzyme
Mol. Mass.:80113.65
Organism:Homo sapiens (Human)
Description:P00736
Residue:705
BDBM50289001
NameBDBM50289001
Synonyms:2-(2-Iodo-phenyl)-6,7-dimethoxy-benzo[d][1,3]oxazin-4-one US9695194, 18
TypeSmall organic molecule
Emp. Form.C16H12INO4
Mol. Mass.409.1753
SMILESCOc1cc2nc(oc(=O)c2cc1OC)-c1ccccc1I