Reaction Details
TargetComplement C1r subcomponent
LigandBDBM50289002
Substrate/Competitorn/a
Meas. Tech.ChEMBL_40171 (CHEMBL655966)
IC50>62500±n/a nM
Citation Gilmore, JLHays, SJCaprathe, BWLee, CEmmerling, MRMichael, WJaen, JC Synthesis and evaluation of 2-aryl-4H-3,1-benzoxazin-4-ones as C1r serine protease inhibitors Bioorg Med Chem Lett6:679-682 (1996)    Article
 
Complement C1r subcomponent
Name:Complement C1r subcomponent
Type:Enzyme
Mol. Mass.:80113.65
Organism:Homo sapiens (Human)
Description:P00736
Residue:705
BDBM50289002
NameBDBM50289002
Synonyms:7-Chloro-2-(2-iodo-phenyl)-benzo[d][1,3]oxazin-4-one | CHEMBL346547
TypeSmall organic molecule
Emp. Form.C14H7ClINO2
Mol. Mass.383.568
SMILESClc1ccc2c(c1)nc(oc2=O)-c1ccccc1I