Reaction Details
TargetCaspase-1
LigandBDBM50289398
Substrate/Competitorn/a
Meas. Tech.ChEBML_90985
Ki 0.200000±n/a nM
Citation Semple, GAshworth, DMBaker, GRBatt, ARBaxter, AJBenzies, DWElliot, LHEvans, DFranklin, RJHudson, PJenkins, PDPitt, GRRooker, DPSheppard, ASzelke, MYamamoto, SIsomura, Y PYRIDONE-BASED PEPTIDOMIMETIC INHIBITORS OF INTERLEUKIN-1β-CONVERTING ENZYME (ICE) Bioorg Med Chem Lett7:1337-1342 (1997)    Article
 
Caspase-1
Name:Caspase-1
Type:Enzyme
Mol. Mass.:45154.13
Organism:Homo sapiens (Human)
Description:P29466
Residue:404
BDBM50289398
NameBDBM50289398
Synonyms:CHEMBL553107 | Peptidic phenyl ketoether analogue
TypeSmall organic molecule
Emp. Form.C32H35N3O7
Mol. Mass.573.6362
SMILESCC(C)[C@H](NC(=O)c1ccc2ccccc2c1)C(=O)N1CCC[C@H]1C(=O)NC(CC(O)=O)C(=O)COc1ccccc1