Reaction Details
TargetCaspase-1
LigandBDBM50289408
Substrate/Competitorn/a
Meas. Tech.ChEBML_90985
Ki 5.3±n/a nM
Citation Semple, GAshworth, DMBaker, GRBatt, ARBaxter, AJBenzies, DWElliot, LHEvans, DFranklin, RJHudson, PJenkins, PDPitt, GRRooker, DPSheppard, ASzelke, MYamamoto, SIsomura, Y PYRIDONE-BASED PEPTIDOMIMETIC INHIBITORS OF INTERLEUKIN-1β-CONVERTING ENZYME (ICE) Bioorg Med Chem Lett7:1337-1342 (1997)    Article
 
Caspase-1
Name:Caspase-1
Type:Enzyme
Mol. Mass.:45154.13
Organism:Homo sapiens (Human)
Description:P29466
Residue:404
BDBM50289408
NameBDBM50289408
Synonyms:(S)-3-(2-{3-[(Naphthalene-1-carbonyl)-amino]-2-oxo-2H-pyridin-1-yl}-hexanoylamino)-4-oxo-5-phenoxy-pentanoic acid | CHEMBL282198
TypeSmall organic molecule
Emp. Form.C33H33N3O7
Mol. Mass.583.631
SMILESCCCCC(C(=O)N[C@@H](CC(O)=O)C(=O)COc1ccccc1)n1cccc(NC(=O)c2cccc3ccccc23)c1=O