Reaction Details
TargetProthrombin
LigandBDBM50289560
Substrate/Competitorn/a
Meas. Tech.ChEBML_208130
IC50 0.467000±n/a nM
Citation Tamura, SYSemple, JEReiner, JEGoldman, EABrunck, TKLim-Wilby, MSCarpenter, SHRote, WEOldeshulte, GLRichard, BMNutt, RFRipka, WC Design and synthesis of a novel class of thrombin inhibitors incorporating heterocyclic dipeptide surrogates Bioorg Med Chem Lett7:1543-1548 (1997)    Article
 
Prothrombin
Name:Prothrombin
Type:Protein
Mol. Mass.:70029.57
Organism:Homo sapiens (Human)
Description:P00734
Residue:622
BDBM50289560
NameBDBM50289560
Synonyms:CHEMBL289389 | N-((S)-1-Carbamimidoyl-2-hydroxy-piperidin-3-yl)-2-(6-methyl-2-oxo-3-phenylmethanesulfonylamino-2H-pyridin-1-yl)-acetamide
TypeSmall organic molecule
Emp. Form.C21H28N6O5S
Mol. Mass.476.549
SMILESCc1ccc(NS(=O)(=O)Cc2ccccc2)c(=O)n1CC(=O)N[C@H]1CCCN(C1O)C(N)=N