Reaction Details
TargetBeta-2 adrenergic receptor
LigandBDBM50002133
Substrate/Competitorn/a
Meas. Tech.ChEBML_38464
Ki 630±n/a nM
Citation Sher, PMMathur, AFisher, LGWu, GSkwish, SMichel, IMSeiler, SMDickinson, KE Carboxyl-promoted enhancement of selectivity for the β3 adrenergic receptor. Negative charge of the sulfonic acid BMS-187413 introduces-β3 binding selectivity Bioorg Med Chem Lett7:1583-1588 (1997)    Article
 
Beta-2 adrenergic receptor
Name:Beta-2 adrenergic receptor
Type:n/a
Mol. Mass.:46461.69
Organism:Homo sapiens (Human)
Description:P07550
Residue:413
BDBM50002133
NameBDBM50002133
Synonyms:(+/-)-2-(4-((R)-2-((R)-2-(3-chlorophenyl)-2-hydroxyethylamino)propyl)phenoxy)acetic acid (4-{2-[(R)-2-((R)-3-Chloro-phenyl)-2-hydroxy-ethylamino]-propyl}-phenoxy)-acetic acid (BRL 37,344)(4-{2-[2-(3-Chloro-phenyl)-2-hydroxy-ethylamino]-propyl}-phenoxy)-acetic acid 2-(4-((R)-2-((R)-2-(3-chlorophenyl)-2-hydroxyethylamino)propyl)phenoxy)acetic acid CHEMBL284782
TypeSmall organic molecule
Emp. Form.C19H22ClNO4
Mol. Mass.363.835
SMILESC[C@H](Cc1ccc(OCC(O)=O)cc1)NC[C@H](O)c1cccc(Cl)c1