Reaction Details
TargetProthrombin
LigandBDBM50289579
Substrate/Competitorn/a
Meas. Tech.ChEBML_208719
Ki 3.5±n/a nM
Citation Quan, MLWityak, JDominguez, CDuncia, JVKettner, CAEllis, CDLiauw, AYPark, JMSantella, JBKnabb, RMThoolen, MJWeber, PCWexler, RR Biaryl substituted alkylboronate esters as thrombin inhibitors Bioorg Med Chem Lett7:1595-1600 (1997)    Article
 
Prothrombin
Name:Prothrombin
Type:Protein
Mol. Mass.:70029.57
Organism:Homo sapiens (Human)
Description:P00734
Residue:622
BDBM50289579
NameBDBM50289579
Synonyms:3'-Methanesulfonylamino-biphenyl-3-carboxylic acid [(R)-4-guanidino-1-((2S,6R)-2,9,9-trimethyl-3,5-dioxa-4-bora-tricyclo[6.1.1.0*2,6*]dec-4-yl)-butyl]-amide | CHEMBL43140
TypeSmall organic molecule
Emp. Form.C29H40BN5O5S
Mol. Mass.581.534
SMILESCC1(C)C2CC1[C@]1(C)OB(O[C@@H]1C2)[C@H](CCCNC(N)=N)NC(=O)c1cccc(c1)-c1cccc(NS(C)(=O)=O)c1