Reaction Details
TargetProthrombin
LigandBDBM50289587
Substrate/Competitorn/a
Meas. Tech.ChEBML_208719
Ki 0.420000±n/a nM
Citation Quan, MLWityak, JDominguez, CDuncia, JVKettner, CAEllis, CDLiauw, AYPark, JMSantella, JBKnabb, RMThoolen, MJWeber, PCWexler, RR Biaryl substituted alkylboronate esters as thrombin inhibitors Bioorg Med Chem Lett7:1595-1600 (1997)    Article
 
Prothrombin
Name:Prothrombin
Type:Protein
Mol. Mass.:70029.57
Organism:Homo sapiens (Human)
Description:P00734
Residue:622
BDBM50289587
NameBDBM50289587
Synonyms:3-Methyl-biphenyl-4-carboxylic acid [(R)-4-guanidino-1-((2S,6R)-2,9,9-trimethyl-3,5-dioxa-4-bora-tricyclo[6.1.1.0*2,6*]dec-4-yl)-butyl]-amide | CHEMBL289318
TypeSmall organic molecule
Emp. Form.C29H39BN4O3
Mol. Mass.502.456
SMILESCc1cc(ccc1C(=O)N[C@@H](CCCNC(N)=N)B1O[C@@H]2CC3CC(C3(C)C)[C@]2(C)O1)-c1ccccc1