Reaction Details
TargetProthrombin
LigandBDBM50289593
Substrate/Competitorn/a
Meas. Tech.ChEBML_208719
Ki 137±n/a nM
Citation Quan, MLWityak, JDominguez, CDuncia, JVKettner, CAEllis, CDLiauw, AYPark, JMSantella, JBKnabb, RMThoolen, MJWeber, PCWexler, RR Biaryl substituted alkylboronate esters as thrombin inhibitors Bioorg Med Chem Lett7:1595-1600 (1997)    Article
 
Prothrombin
Name:Prothrombin
Type:Protein
Mol. Mass.:70029.57
Organism:Homo sapiens (Human)
Description:P00734
Residue:622
BDBM50289593
NameBDBM50289593
Synonyms:5-Phenyl-furan-2-carboxylic acid [(R)-4-guanidino-1-((2S,6R)-2,9,9-trimethyl-3,5-dioxa-4-bora-tricyclo[6.1.1.0*2,6*]dec-4-yl)-butyl]-amide | CHEMBL40364
TypeSmall organic molecule
Emp. Form.C26H35BN4O4
Mol. Mass.478.391
SMILESCC1(C)C2CC1[C@]1(C)OB(O[C@@H]1C2)[C@H](CCCNC(N)=N)NC(=O)c1ccc(o1)-c1ccccc1