Reaction Details
TargetProthrombin
LigandBDBM50289578
Substrate/Competitorn/a
Meas. Tech.ChEBML_208719
Ki 512±n/a nM
Citation Quan, MLWityak, JDominguez, CDuncia, JVKettner, CAEllis, CDLiauw, AYPark, JMSantella, JBKnabb, RMThoolen, MJWeber, PCWexler, RR Biaryl substituted alkylboronate esters as thrombin inhibitors Bioorg Med Chem Lett7:1595-1600 (1997)    Article
 
Prothrombin
Name:Prothrombin
Type:Protein
Mol. Mass.:70029.57
Organism:Homo sapiens (Human)
Description:P00734
Residue:622
BDBM50289578
NameBDBM50289578
Synonyms:CHEMBL418427 | N-[(R)-4-Guanidino-1-(4,4,5,5-tetramethyl-[1,3,2]dioxaborolan-2-yl)-butyl]-benzamide
TypeSmall organic molecule
Emp. Form.C18H29BN4O3
Mol. Mass.360.259
SMILESCC1(C)OB(OC1(C)C)[C@H](CCCNC(N)=N)NC(=O)c1ccccc1