Reaction Details
TargetD(4) dopamine receptor
LigandBDBM50290036
Substrate/Competitorn/a
Meas. Tech.ChEBML_58934
Ki 17±n/a nM
Citation Haworth, KEHarrison, TKulagowski, JJLeeson, PDOwens, APRidgill, MPTeall, MRFielding, MChapman, KEmms, FMarwood, RPatel, SMoss, KL 4-Heterocyclyl tetrahydropyridines as selective ligands for the human dopamine D4 receptor Bioorg Med Chem Lett7:2211-2216 (1997)    Article
 
D(4) dopamine receptor
Name:D(4) dopamine receptor
Type:Enzyme
Mol. Mass.:48373.19
Organism:Homo sapiens (Human)
Description:P21917
Residue:419
BDBM50290036
NameBDBM50290036
Synonyms:2-(1-Benzyl-1,2,3,6-tetrahydro-pyridin-4-yl)-5-chloro-benzooxazole | CHEMBL69356
TypeSmall organic molecule
Emp. Form.C19H17ClN2O
Mol. Mass.324.804
SMILESClc1ccc2oc(nc2c1)C1=CCN(Cc2ccccc2)CC1