Reaction Details
TargetMu-type opioid receptor
LigandBDBM50290076
Substrate/Competitorn/a
Meas. Tech.ChEBML_145292
Ki 8.4±n/a nM
Citation Pechulis, ADArcher, SWentland, MPColasurdo, AMBidlack, JM Arylacetamide kappa-selective opioid ligands Bioorg Med Chem Lett7:2271-2276 (1997)    Article
 
Mu-type opioid receptor
Name:Mu-type opioid receptor
Type:Enzyme Catalytic Domain
Mol. Mass.:11165.58
Organism:GUINEA PIG
Description:P97266
Residue:98
BDBM50290076
NameBDBM50290076
Synonyms:CHEMBL558596 | N-[(S)-1-(3-Acetylamino-phenyl)-2-pyrrolidin-1-yl-ethyl]-2-(3,4-dichloro-phenyl)-N-methyl-acetamide; hydrochloride
TypeSmall organic molecule
Emp. Form.C23H27Cl2N3O2
Mol. Mass.448.385
SMILESCN([C@H](CN1CCCC1)c1cccc(NC(C)=O)c1)C(=O)Cc1ccc(Cl)c(Cl)c1