Reaction Details
TargetRetinoic acid receptor RXR-gamma
LigandBDBM50290191
Substrate/Competitorn/a
Meas. Tech.ChEMBL_197222 (CHEMBL798970)
EC50 40±n/a nM
Citation Farmer, LJJeong, SKallel, EAKoch, SSCroston, GEFlatten, KSHeyman, RANadzan, AM Synthesis and structure-activity relationships of potent retinoid X receptor ligands Bioorg Med Chem Lett7:2393-2398 (1997)    Article
 
Retinoic acid receptor RXR-gamma
Name:Retinoic acid receptor RXR-gamma
Type:PROTEIN
Mol. Mass.:50900.28
Organism:Mus musculus
Description:ChEMBL_196589
Residue:463
BDBM50290191
NameBDBM50290191
Synonyms:3-Methyl-5-[2-(5,5,8,8-tetramethyl-5,6,7,8-tetrahydro-naphthalen-2-yl)-cyclopent-1-enyl]-penta-2,4-dienoic acid | CHEMBL79234
TypeSmall organic molecule
Emp. Form.C25H32O2
Mol. Mass.364.5204
SMILESC\C(\C=C\C1=C(CCC1)c1ccc2c(c1)C(C)(C)CCC2(C)C)=C/C(O)=O