Reaction Details
TargetProthrombin
LigandBDBM50073429
Substrate/Competitorn/a
Meas. Tech.ChEBML_48295
IC50 0.710000±n/a nM
Citation Semple, JEMinami, NKTamura, SYBrunck, TKNutt, RFRipka, WC Rational design and synthesis of a novel, selective class of thrombin inhibitors: P1-argininal derivatives incorporating P3---P4 quaternary lactam dipeptide surrogates Bioorg Med Chem Lett7:2421-2426 (1997)    Article
 
Prothrombin
Name:Prothrombin
Type:Protein
Mol. Mass.:70029.57
Organism:Homo sapiens (Human)
Description:P00734
Residue:622
BDBM50073429
NameBDBM50073429
Synonyms:CHEMBL82032 N-((S)-1-Carbamimidoyl-2-hydroxy-piperidin-3-yl)-2-((S)-2-oxo-3-phenylmethanesulfonylamino-azepan-1-yl)-acetamide
TypeSmall organic molecule
Emp. Form.C21H32N6O5S
Mol. Mass.480.581
SMILESNC(=N)N1CCC[C@H](NC(=O)CN2CCCC[C@H](NS(=O)(=O)Cc3ccccc3)C2=O)C1O