Reaction Details
TargetPeroxisome proliferator-activated receptor gamma
LigandBDBM50290273
Substrate/Competitorn/a
Meas. Tech.ChEBML_154360
Ki 1200±n/a nM
Citation Tomkinson, NCSefler, AMPlunket, KDBlanchard, SGParks, DJWillson, TM Solid-phase synthesis of hybrid thiazolidinedione-fatty acid PPARγ ligands Bioorg Med Chem Lett7:2491-2496 (1997)    Article
 
Peroxisome proliferator-activated receptor gamma
Name:Peroxisome proliferator-activated receptor gamma
Type:Nuclear Receptor
Mol. Mass.:57613.46
Organism:Homo sapiens (Human)
Description:P37231
Residue:505
BDBM50290273
NameBDBM50290273
Synonyms:(E)-Pent-2-enoic acid {2-[4-(2,4-dioxo-thiazolidin-5-ylmethyl)-phenoxy]-ethyl}-methyl-amide | CHEMBL83058
TypeSmall organic molecule
Emp. Form.C18H22N2O4S
Mol. Mass.362.443
SMILESCC\C=C\C(=O)N(C)CCOc1ccc(Cc2sc(=O)[nH]c2O)cc1