Reaction Details
TargetRetinoic acid receptor RXR-beta
LigandBDBM50290662
Substrate/Competitorn/a
Meas. Tech.ChEMBL_196638 (CHEMBL800751)
Ki>1000±n/a nM
Citation Farmer, LJZhi, LJeong, SKallel, EACroston, GFlatten, KSHeyman, RANadzan, AM Synthesis and structure-activity relationships of potent conformationally restricted retinoid X receptor ligands Bioorg Med Chem Lett7:2747-2752 (1997)    Article
 
Retinoic acid receptor RXR-beta
Name:Retinoic acid receptor RXR-beta
Type:PROTEIN
Mol. Mass.:56932.89
Organism:Homo sapiens (Human)
Description:ChEMBL_39045
Residue:533
BDBM50290662
NameBDBM50290662
Synonyms:(2E,4E)-3-Methyl-5-[1-(3,5,5,8,8-pentamethyl-5,6,7,8-tetrahydro-naphthalen-2-yl)-cyclopentyl]-penta-2,4-dienoic acid | CHEMBL92394
TypeSmall organic molecule
Emp. Form.C26H36O2
Mol. Mass.380.5628
SMILESC\C(\C=C\C1(CCCC1)c1cc2c(cc1C)C(C)(C)CCC2(C)C)=C/C(O)=O