Reaction Details
TargetRetinoic acid receptor RXR-gamma
LigandBDBM50290661
Substrate/Competitorn/a
Meas. Tech.ChEMBL_196651 (CHEMBL800764)
EC50 192±n/a nM
Citation Farmer, LJZhi, LJeong, SKallel, EACroston, GFlatten, KSHeyman, RANadzan, AM Synthesis and structure-activity relationships of potent conformationally restricted retinoid X receptor ligands Bioorg Med Chem Lett7:2747-2752 (1997)    Article
 
Retinoic acid receptor RXR-gamma
Name:Retinoic acid receptor RXR-gamma
Type:PROTEIN
Mol. Mass.:50878.26
Organism:Homo sapiens (Human)
Description:ChEMBL_197216
Residue:463
BDBM50290661
NameBDBM50290661
Synonyms:(2E,4E)-3-Methyl-5-[1-(5,5,8,8-tetramethyl-5,6,7,8-tetrahydro-naphthalen-2-yl)-cyclopentyl]-penta-2,4-dienoic acid | CHEMBL93848
TypeSmall organic molecule
Emp. Form.C25H34O2
Mol. Mass.366.5363
SMILESC\C(\C=C\C1(CCCC1)c1ccc2c(c1)C(C)(C)CCC2(C)C)=C/C(O)=O