Reaction Details
TargetRetinoic acid receptor beta
LigandBDBM50033079
Substrate/Competitorn/a
Meas. Tech.ChEMBL_195820 (CHEMBL800284)
Ki 909±n/a nM
Citation Farmer, LJZhi, LJeong, SKallel, EACroston, GFlatten, KSHeyman, RANadzan, AM Synthesis and structure-activity relationships of potent conformationally restricted retinoid X receptor ligands Bioorg Med Chem Lett7:2747-2752 (1997)    Article
 
Retinoic acid receptor beta
Name:Retinoic acid receptor beta
Type:PROTEIN
Mol. Mass.:50498.70
Organism:Homo sapiens (Human)
Description:ChEMBL_1458015
Residue:455
BDBM50033079
NameBDBM50033079
Synonyms:4-[1-(5,5,8,8-Tetramethyl-5,6,7,8-tetrahydro-naphthalen-2-yl)-vinyl]-benzoic acid | CHEMBL96184
TypeSmall organic molecule
Emp. Form.C23H26O2
Mol. Mass.334.4513
SMILESCC1(C)CCC(C)(C)c2cc(ccc12)C(=C)c1ccc(cc1)C(O)=O