Reaction Details
TargetRetinoic acid receptor gamma
LigandBDBM50290659
Substrate/Competitorn/a
Meas. Tech.ChEMBL_196174 (CHEMBL804947)
EC50 399±n/a nM
Citation Farmer, LJZhi, LJeong, SKallel, EACroston, GFlatten, KSHeyman, RANadzan, AM Synthesis and structure-activity relationships of potent conformationally restricted retinoid X receptor ligands Bioorg Med Chem Lett7:2747-2752 (1997)    Article
 
Retinoic acid receptor gamma
Name:Retinoic acid receptor gamma
Type:PROTEIN
Mol. Mass.:50345.43
Organism:Homo sapiens (Human)
Description:ChEMBL_1458016
Residue:454
BDBM50290659
NameBDBM50290659
Synonyms:(2E,4E)-3-Methyl-5-[1-(5,5,8,8-tetramethyl-5,6,7,8-tetrahydro-naphthalen-2-yl)-cyclopropyl]-penta-2,4-dienoic acid | CHEMBL93518
TypeSmall organic molecule
Emp. Form.C23H30O2
Mol. Mass.338.4831
SMILESC\C(\C=C\C1(CC1)c1ccc2c(c1)C(C)(C)CCC2(C)C)=C/C(O)=O