Reaction Details
TargetRetinoic acid receptor gamma
LigandBDBM50290661
Substrate/Competitorn/a
Meas. Tech.ChEBML_196331
Ki>1000±n/a nM
Citation Farmer, LJZhi, LJeong, SKallel, EACroston, GFlatten, KSHeyman, RANadzan, AM Synthesis and structure-activity relationships of potent conformationally restricted retinoid X receptor ligands Bioorg Med Chem Lett7:2747-2752 (1997)    Article
 
Retinoic acid receptor gamma
Name:Retinoic acid receptor gamma
Type:PROTEIN
Mol. Mass.:50345.43
Organism:Homo sapiens (Human)
Description:ChEMBL_1458016
Residue:454
BDBM50290661
NameBDBM50290661
Synonyms:(2E,4E)-3-Methyl-5-[1-(5,5,8,8-tetramethyl-5,6,7,8-tetrahydro-naphthalen-2-yl)-cyclopentyl]-penta-2,4-dienoic acid | CHEMBL93848
TypeSmall organic molecule
Emp. Form.C25H34O2
Mol. Mass.366.5363
SMILESC\C(\C=C\C1(CCCC1)c1ccc2c(c1)C(C)(C)CCC2(C)C)=C/C(O)=O