Reaction Details
TargetMu-type opioid receptor
LigandBDBM50060080
Substrate/Competitorn/a
Meas. Tech.ChEMBL_138751 (CHEMBL747924)
Ki 28411±n/a nM
Citation Liao, SLin, JShenderovich, MDHan, YHasohata, KDavis, PQiu, WPorreca, FYamamura, HIHruby, VJ The stereochemical requirements of the novel δ-opioid selective dipeptide antagonist TMT-Tic Bioorg Med Chem Lett7:3049-3052 (1997)    Article
 
Mu-type opioid receptor
Name:Mu-type opioid receptor
Type:Enzyme Catalytic Domain
Mol. Mass.:11165.58
Organism:GUINEA PIG
Description:P97266
Residue:98
BDBM50060080
NameBDBM50060080
Synonyms:2-({2-[(R)-2-Amino-3-(4-hydroxy-2,6-dimethyl-phenyl)-propionyl]-1,2,3,4-tetrahydro-isoquinoline-3-carbonyl}-amino)-propionic acid | CHEMBL485576
TypeSmall organic molecule
Emp. Form.C19H20N2O4
Mol. Mass.340.3731
SMILESN[C@@H](Cc1ccc(O)cc1)C(=O)N1Cc2ccccc2C[C@H]1C(O)=O