Reaction Details
TargetMu-type opioid receptor
LigandBDBM50088375
Substrate/Competitorn/a
Meas. Tech.ChEBML_138995
Ki>1000±n/a nM
Citation Sabin, VHorwell, DCMcKnight, ATBroqua, P trans N-Methyl-N-[2-(1-pyrrolidinyl)cyclohexyl] cycloprop-2-ene-1-carboxamides: Novel lipophilic kappa opioid agonists Bioorg Med Chem Lett7:291-296 (1997)    Article
 
Mu-type opioid receptor
Name:Mu-type opioid receptor
Type:G Protein-Coupled Receptor (GPCR)
Mol. Mass.:44503.11
Organism:Rattus norvegicus (rat)
Description:Competition binding assays were carried out using membrane preparations from transfected HN9.10 cells that constitutively expressed the mu opioid receptor.
Residue:398
BDBM50088375
NameBDBM50088375
Synonyms:1-{8-[(2,3-Diphenyl-cycloprop-2-enecarbonyl)-methyl-amino]-1-oxa-spiro[4.5]dec-7-yl}-pyrrolidinium
TypeSmall organic molecule
Emp. Form.C30H37N2O2
Mol. Mass.457.6264
SMILESCN([C@H]1CC[C@@]2(CCCO2)C[C@@H]1[NH+]1CCCC1)C(=O)C1C(=C1c1ccccc1)c1ccccc1