Reaction Details
TargetKappa-type opioid receptor
LigandBDBM50088375
Substrate/Competitorn/a
Meas. Tech.ChEBML_145826
Ki 0.640000±n/a nM
Citation Sabin, VHorwell, DCMcKnight, ATBroqua, P trans N-Methyl-N-[2-(1-pyrrolidinyl)cyclohexyl] cycloprop-2-ene-1-carboxamides: Novel lipophilic kappa opioid agonists Bioorg Med Chem Lett7:291-296 (1997)    Article
 
Kappa-type opioid receptor
Name:Kappa-type opioid receptor
Type:G Protein-Coupled Receptor (GPCR)
Mol. Mass.:42692.90
Organism:Rattus norvegicus (rat)
Description:P34975
Residue:380
BDBM50088375
NameBDBM50088375
Synonyms:1-{8-[(2,3-Diphenyl-cycloprop-2-enecarbonyl)-methyl-amino]-1-oxa-spiro[4.5]dec-7-yl}-pyrrolidinium
TypeSmall organic molecule
Emp. Form.C30H37N2O2
Mol. Mass.457.6264
SMILESCN([C@H]1CC[C@@]2(CCCO2)C[C@@H]1[NH+]1CCCC1)C(=O)C1C(=C1c1ccccc1)c1ccccc1