Reaction Details
TargetCalpain-1 catalytic subunit
LigandBDBM50291176
Substrate/Competitorn/a
Meas. Tech.ChEBML_43860
IC50 15±n/a nM
Citation Iqbal, MMessina, PAFreed, BDas, MChatterjee, STripathy, RTao, MJosef, KADembofsky, BDunn, DGriffith, ESiman, RSenadhi, SEBiazzo, WBozyczko-Coyne, DMeyer, SLAtor, MABihovsky, R Subsite requirements for peptide aldehyde inhibitors of human calpain I Bioorg Med Chem Lett7:539-544 (1997)    Article
 
Calpain-1 catalytic subunit
Name:Calpain-1 catalytic subunit
Type:Protein
Mol. Mass.:81880.51
Organism:Homo sapiens (Human)
Description:n/a
Residue:714
BDBM50291176
NameBDBM50291176
Synonyms:(S)-2-Acetylamino-4-methyl-pentanoic acid [(R)-1-((R)-1-formyl-3-methyl-butylcarbamoyl)-3-methyl-butyl]-amide | CHEMBL151206
TypeSmall organic molecule
Emp. Form.C20H37N3O4
Mol. Mass.383.5255
SMILESCC(C)C[C@@H](NC(=O)[C@@H](CC(C)C)NC(=O)[C@H](CC(C)C)NC(C)=O)C=O