Reaction Details
TargetCalpain-1 catalytic subunit
LigandBDBM50291181
Substrate/Competitorn/a
Meas. Tech.ChEBML_43860
IC50 12±n/a nM
Citation Iqbal, MMessina, PAFreed, BDas, MChatterjee, STripathy, RTao, MJosef, KADembofsky, BDunn, DGriffith, ESiman, RSenadhi, SEBiazzo, WBozyczko-Coyne, DMeyer, SLAtor, MABihovsky, R Subsite requirements for peptide aldehyde inhibitors of human calpain I Bioorg Med Chem Lett7:539-544 (1997)    Article
 
Calpain-1 catalytic subunit
Name:Calpain-1 catalytic subunit
Type:Protein
Mol. Mass.:81880.51
Organism:Homo sapiens (Human)
Description:n/a
Residue:714
BDBM50291181
NameBDBM50291181
Synonyms:CHEMBL150976 | {(S)-2-tert-Butoxy-1-[(R)-1-((R)-1-formyl-3-methyl-butylcarbamoyl)-3-methyl-butylcarbamoyl]-ethyl}-carbamic acid benzyl ester
TypeSmall organic molecule
Emp. Form.C27H43N3O6
Mol. Mass.505.6468
SMILESCC(C)C[C@@H](NC(=O)[C@@H](CC(C)C)NC(=O)[C@H](COC(C)(C)C)NC(=O)OCc1ccccc1)C=O