Reaction Details
TargetCalpain-1 catalytic subunit
LigandBDBM50291205
Substrate/Competitorn/a
Meas. Tech.ChEBML_43860
IC50 12±n/a nM
Citation Iqbal, MMessina, PAFreed, BDas, MChatterjee, STripathy, RTao, MJosef, KADembofsky, BDunn, DGriffith, ESiman, RSenadhi, SEBiazzo, WBozyczko-Coyne, DMeyer, SLAtor, MABihovsky, R Subsite requirements for peptide aldehyde inhibitors of human calpain I Bioorg Med Chem Lett7:539-544 (1997)    Article
 
Calpain-1 catalytic subunit
Name:Calpain-1 catalytic subunit
Type:Protein
Mol. Mass.:81880.51
Organism:Homo sapiens (Human)
Description:n/a
Residue:714
BDBM50291205
NameBDBM50291205
Synonyms:CHEMBL358404 | [(S)-1-((S)-1-Formyl-3-methyl-butylcarbamoyl)-3-methyl-butyl]-carbamic acid methyl ester
TypeSmall organic molecule
Emp. Form.C14H26N2O4
Mol. Mass.286.3672
SMILESCOC(=O)N[C@@H](CC(C)C)C(=O)N[C@@H](CC(C)C)C=O