Reaction Details
TargetLeukotriene B4 receptor 1
LigandBDBM50291512
Substrate/Competitorn/a
Meas. Tech.ChEBML_98513
IC50 190±n/a nM
Citation Greenspan, PDMain, AJBhagwat, SSBarsky, LIDoti, RAEngle, ARFrey, LMZhou, HLipson, KEChin, MHJackson, RHUziel-Fusi, S N-aryl cinnamides: A novel class of rigid and highly potent leukotriene B4 receptor antagonists Bioorg Med Chem Lett7:949-954 (1997)    Article
 
Leukotriene B4 receptor 1
Name:Leukotriene B4 receptor 1
Type:Enzyme Catalytic Domain
Mol. Mass.:37582.68
Organism:Homo sapiens (Human)
Description:Q15722
Residue:352
BDBM50291512
NameBDBM50291512
Synonyms:3-((E)-3-Biphenyl-4-yl-acryloylamino)-4-ethoxy-benzoic acid | CHEMBL174638
TypeSmall organic molecule
Emp. Form.C24H21NO4
Mol. Mass.387.4278
SMILESCCOc1ccc(cc1NC(=O)\C=C\c1ccc(cc1)-c1ccccc1)C(O)=O