Reaction Details
TargetPotassium voltage-gated channel subfamily A member 3
LigandBDBM50098785
Substrate/Competitorn/a
Meas. Tech.ChEBML_214951
IC50 200±n/a nM
Citation Burgess, LEKoch, KCooper, KBiggers, MSRamchandani, MSmitrovich, JHGilbert, EJBruns, MJMather, RJDonovan, CBHanson, DC The SAR of UK-78,282: A novel blocker of human T cell Kv1.3 potassium channels Bioorg Med Chem Lett7:1047-1052 (1997)    Article
 
Potassium voltage-gated channel subfamily A member 3
Name:Potassium voltage-gated channel subfamily A member 3
Type:PROTEIN
Mol. Mass.:63835.47
Organism:Homo sapiens (Human)
Description:ChEMBL_1513935
Residue:575
BDBM50098785
NameBDBM50098785
Synonyms:4-Benzhydryloxymethyl-1-[3-(4-methoxy-phenyl)-propyl]-piperidine UK-78282
TypeSmall organic molecule
Emp. Form.C29H35NO2
Mol. Mass.429.5937
SMILESCOc1ccc(CCCN2CCC(COC(c3ccccc3)c3ccccc3)CC2)cc1