Reaction Details
TargetHypoxanthine-guanine phosphoribosyltransferase
LigandBDBM50293828
Substrate/Competitorn/a
Meas. Tech.ChEMBL_572371 (CHEMBL1035272)
pH7.4±n/a
Ki 140000±n/a nM
Commentsextracted
Citation Keough, DTHocková, DHolý, ANaesens, LMSkinner-Adams, TSJersey, JGuddat, LW Inhibition of hypoxanthine-guanine phosphoribosyltransferase by acyclic nucleoside phosphonates: a new class of antimalarial therapeutics. J Med Chem52:4391-9 (2009) 
 
Hypoxanthine-guanine phosphoribosyltransferase
Name:Hypoxanthine-guanine phosphoribosyltransferase
Type:Protein
Mol. Mass.:24579.61
Organism:Homo sapiens (Human)
Description:P00492
Residue:218
BDBM50293828
NameBDBM50293828
Synonyms:CHEMBL560759 | isopropyl(2-(2-amino-6-oxo-1,6,7,8-tetrahydropurin-9-yl)ethoxy)methylphosphonate
TypeSmall organic molecule
Emp. Form.C11H20N5O5P
Mol. Mass.333.2808
SMILESCC(C)OP(O)(=O)COCCN1CNc2c1nc(N)[nH]c2=O