Reaction Details
TargetHypoxanthine-guanine phosphoribosyltransferase
LigandBDBM50293838
Substrate/Competitorn/a
Meas. Tech.ChEMBL_572369 (CHEMBL1035270)
pH8.5±n/a
Ki 182300±n/a nM
Commentsextracted
Citation Keough, DTHocková, DHolý, ANaesens, LMSkinner-Adams, TSJersey, JGuddat, LW Inhibition of hypoxanthine-guanine phosphoribosyltransferase by acyclic nucleoside phosphonates: a new class of antimalarial therapeutics. J Med Chem52:4391-9 (2009) 
 
Hypoxanthine-guanine phosphoribosyltransferase
Name:Hypoxanthine-guanine phosphoribosyltransferase
Type:Protein
Mol. Mass.:24579.61
Organism:Homo sapiens (Human)
Description:P00492
Residue:218
BDBM50293838
NameBDBM50293838
Synonyms:(2-(6-oxo-1,6,7,8-tetrahydropurin-9-yl)ethoxy)methylphosphonate | CHEMBL564977
TypeSmall organic molecule
Emp. Form.C8H13N4O5P
Mol. Mass.276.1864
SMILESOP(O)(=O)COCCN1CNc2c1nc[nH]c2=O