Reaction Details
TargetNociceptin receptor
LigandBDBM50293856
Substrate/Competitorn/a
Meas. Tech.ChEMBL_572569 (CHEMBL1025185)
IC50 1.9±n/a nM
Citation Satoh, ASagara, TSakoh, HHashimoto, MNakashima, HKato, TGoto, YMizutani, SAzuma-Kanoh, TTani, TOkuda, SOkamoto, OOzaki, SIwasawa, YOhta, HKawamoto, H Identification of an orally active opioid receptor-like 1 (ORL1) receptor antagonist 4-{3-[(2R)-2,3-dihydroxypropyl]-2-oxo-2,3-dihydro-1H-benzimidazol-1-yl}-1-[(1S,3S,4R)-spiro[bicyclo[2.2.1]heptane-2,1'-cyclopropan]-3-ylmethyl]piperidine as clinical candidate. J Med Chem52:4091-4 (2009) 
 
Nociceptin receptor
Name:Nociceptin receptor
Type:G Protein-Coupled Receptor (GPCR)
Mol. Mass.:40702.87
Organism:Homo sapiens (Human)
Description:P41146
Residue:370
BDBM50293856
NameBDBM50293856
Synonyms:1-(2,2-dimethyl-1,3-dioxan-5-yl)-3-{[1S,3R,6S)-2,1'-spirocyclopropane(bicyclo[2.2.1]heptane)-1'-norbornylmethyl]piperidin-4-yl}-1,3-dihydro-2H-benzimidazol-2-one hydrochloride | CHEMBL563980
TypeSmall organic molecule
Emp. Form.C25H35N3O3
Mol. Mass.425.5637
SMILESOC[C@@H](O)Cn1c2ccccc2n(C2CCN(C[C@H]3[C@H]4CC[C@H](C4)C33CC3)CC2)c1=O